Date   

Re: Jenkins Sandbox - Jenkins setup - Issue - Policy Module

jwagantall@...
 

Hi Srinivasan, 

By the looks of it, the API token issue sounds like maybe a permission issue. Have you requested your LFID to be added to the Sandbox group?
If not, please contact support.linuxfoundation.org

The JJB errors sound like maybe you forgot to fetch the submodules. 
Make sure to run "git submodule update --init --recursive" after you cloned the ci-management repo. 

Thanks!

On Fri, Feb 14, 2020 at 1:21 AM Srinivasan Selvam <srinivasanselvam2014@...> wrote:
Hi ONAP members,

I am working in ONAP in policy module.
I am trying to setup policy module CI setup using jenkins-jobs in ONAP sandbox as well as in local.  But I am getting the below errors 

while executing the command
"jenkins-jobs --conf jenkins.ini.example test jjb/policy"

ERROR:
jenkins_jobs.errors.JenkinsJobsException: Failed to find suitable template named '{project-name}-{stream}-verify-java'

And while executing "jenkins-jobs --conf jenkins.ini.example test jjb/policy/policy-api.yaml"

ERROR:
jenkins_jobs.errors.JenkinsJobsException: Failed to find suitable template named 'gerrit-maven-clm'

While executing sample-job template using jenkins sandbox onap API token,
Error:
jenkins.JenkinsException: Error in request. Possibly authentication failed [403]: Forbidden

I have updated the configuration file with the API token generated in https://jenkins.onap.org/sandbox after logging in with LF ID and also the user name

I have noticed that executing particular yaml file is failing when giving 
jenkins-jobs --conf test jenkins.ini.example <path for policy-api.yaml> (or)
jenkins-jobs --conf update jenkins.ini.example <path for policy-api.yaml>,  it gets failed in local but while executing the complete jjb/ directory , all the jobs related to ci-management gettting created in local.

Do we have any order in the execution of yaml files present in ci-management to create policy related jenkins jobs in sandbox of onap / local environment?

It would be really helpful, if someone help us to resolve this issue.

Referred link,

Thanks,
Srinivasan


[sdc] sdc-amsterdam-csit-sanity-testng - Build # 20 - Still Failing!

Jenkins <donotreply@...>
 

sdc-amsterdam-csit-sanity-testng - Build # 20 - Still Failing:

Please refer to the logs server URL for console logs when possible
and use the Jenkins Build URL as a last resort.

Console Logs URL:
https://logs.onap.org/production/vex-yul-ecomp-jenkins-1/sdc-amsterdam-csit-sanity-testng/20

Jenkins Build URL:
https://jenkins.onap.org/job/sdc-amsterdam-csit-sanity-testng/20/


Build failed in Jenkins: sdc-amsterdam-csit-sanity-testng #20

Jenkins <donotreply@...>
 

See <https://jenkins.onap.org/job/sdc-amsterdam-csit-sanity-testng/20/display/redirect?page=changes>

Changes:

[os0695] Set VID version to 1.1.2

[gary.i.wu] Update DCAE designate config

[gary.i.wu] Bump policy docker versions

[gary.i.wu] Use numeric IP addresses for lab end points

------------------------------------------
[...truncated 90.73 KB...]
+ SUITES=<https://jenkins.onap.org/job/sdc-amsterdam-csit-sanity-testng/ws/test/csit/tests/sdc/sanity>
+ echo ROBOT_VARIABLES=-v BE_IP:172.17.0.4
ROBOT_VARIABLES=-v BE_IP:172.17.0.4
+ echo 'Starting Robot test suites <https://jenkins.onap.org/job/sdc-amsterdam-csit-sanity-testng/ws/test/csit/tests/sdc/sanity> ...'
Starting Robot test suites <https://jenkins.onap.org/job/sdc-amsterdam-csit-sanity-testng/ws/test/csit/tests/sdc/sanity> ...
+ set +e
+ pybot -N plans/sdc/sanity -v WORKSPACE:/tmp -v BE_IP:172.17.0.4 <https://jenkins.onap.org/job/sdc-amsterdam-csit-sanity-testng/ws/test/csit/tests/sdc/sanity>
==============================================================================
plans/sdc/sanity :: Sdc - HealthCheck
==============================================================================
plans/sdc/sanity.Test1
==============================================================================
Get Requests health check ok | FAIL |
500 != 200
------------------------------------------------------------------------------
plans/sdc/sanity.Test1 | FAIL |
1 critical test, 0 passed, 1 failed
1 test total, 0 passed, 1 failed
==============================================================================
plans/sdc/sanity :: Sdc - HealthCheck | FAIL |
1 critical test, 0 passed, 1 failed
1 test total, 0 passed, 1 failed
==============================================================================
Output: /tmp/tmp.x1x2CC9ADW-robot-workdir/output.xml
Log: /tmp/tmp.x1x2CC9ADW-robot-workdir/log.html
Report: /tmp/tmp.x1x2CC9ADW-robot-workdir/report.html
+ RESULT=1
+ set -e
+ echo 'RESULT: ' 1
RESULT: 1
+ rsync -av /tmp/tmp.x1x2CC9ADW-robot-workdir/ <https://jenkins.onap.org/job/sdc-amsterdam-csit-sanity-testng/ws/archives>
sending incremental file list
./
log.html
output.xml
report.html
testplan.txt

sent 422,931 bytes received 95 bytes 846,052.00 bytes/sec
total size is 422,505 speedup is 1.00
+ docker ps --format '{{.Image}}'
+ docker_stats
+ echo '> top -bn1 | head -3'
+ tee <https://jenkins.onap.org/job/sdc-amsterdam-csit-sanity-testng/ws/archives/_sysinfo-2-after-robot.txt>
+ head -3
top -bn1 | head -3
+ top -bn1
top - 16:38:31 up 1:08, 0 users, load average: 1.66, 0.94, 0.79
Tasks: 204 total, 1 running, 203 sleeping, 0 stopped, 0 zombie
%Cpu(s): 2.3 us, 0.5 sy, 0.0 ni, 93.9 id, 3.2 wa, 0.0 hi, 0.0 si, 0.0 st
+ echo

+ echo '> free -h'
free -h
+ free -h
total used free shared buff/cache available
Mem: 7.8G 6.2G 828M 8.9M 776M 1.2G
Swap: 0B 0B 0B
+ echo

+ echo '> docker ps'
docker ps
+ docker ps
CONTAINER ID IMAGE COMMAND CREATED STATUS PORTS NAMES
f8a99c698e3d nexus3.onap.org:10001/openecomp/sdc-frontend:1.1.1-STAGING-latest "/root/startup.sh" 13 minutes ago Up 13 minutes 0.0.0.0:8181->8181/tcp, 8080/tcp, 0.0.0.0:9443->9443/tcp sdc-FE
56f930941b7d nexus3.onap.org:10001/openecomp/sdc-backend:1.1.1-STAGING-latest "/root/startup.sh" 23 minutes ago Up 23 minutes 0.0.0.0:8080->8080/tcp, 0.0.0.0:8443->8443/tcp sdc-BE
145530d6c800 nexus3.onap.org:10001/openecomp/sdc-cassandra:1.1.1-STAGING-latest "/root/startup.sh" 43 minutes ago Up 43 minutes 7000-7001/tcp, 0.0.0.0:9042->9042/tcp, 7199/tcp, 0.0.0.0:9160->9160/tcp sdc-cs
78ed8f8f6455 nexus3.onap.org:10001/openecomp/sdc-elasticsearch:1.1.1-STAGING-latest "/root/startup.sh" 56 minutes ago Up 56 minutes 0.0.0.0:9200->9200/tcp, 0.0.0.0:9300->9300/tcp sdc-es
+ echo

+ echo '> docker stats --no-stream'
docker stats --no-stream
+ docker stats --no-stream
CONTAINER CPU % MEM USAGE / LIMIT MEM % NET I/O BLOCK I/O PIDS
f8a99c698e3d 2.38% 938.8 MiB / 2 GiB 45.84% 464.3 kB / 302 kB 1.118 MB / 315.4 kB 50
56f930941b7d 18.27% 2.061 GiB / 4 GiB 51.54% 111.4 MB / 28.79 MB 49.85 MB / 17.42 MB 146
145530d6c800 0.85% 2.314 GiB / 7.796 GiB 29.69% 26.37 MB / 109.8 MB 876.5 kB / 340.1 MB 113
78ed8f8f6455 0.27% 561.4 MiB / 1 GiB 54.82% 629.9 kB / 472.6 kB 3.052 MB / 2.142 MB 102
+ echo

+ cd <https://jenkins.onap.org/job/sdc-amsterdam-csit-sanity-testng/ws/test/csit/plans/sdc/sanity>
+ TEARDOWN=<https://jenkins.onap.org/job/sdc-amsterdam-csit-sanity-testng/ws/test/csit/plans/sdc/sanity/teardown.sh>
+ '[' -f <https://jenkins.onap.org/job/sdc-amsterdam-csit-sanity-testng/ws/test/csit/plans/sdc/sanity/teardown.sh> ']'
+ echo 'Running teardown script <https://jenkins.onap.org/job/sdc-amsterdam-csit-sanity-testng/ws/test/csit/plans/sdc/sanity/teardown.sh'>
Running teardown script <https://jenkins.onap.org/job/sdc-amsterdam-csit-sanity-testng/ws/test/csit/plans/sdc/sanity/teardown.sh>
+ source <https://jenkins.onap.org/job/sdc-amsterdam-csit-sanity-testng/ws/test/csit/plans/sdc/sanity/teardown.sh>
++ source <https://jenkins.onap.org/job/sdc-amsterdam-csit-sanity-testng/ws/test/csit/scripts/sdc/kill_containers_and_remove_dataFolders.sh>
+++ echo 'This is <https://jenkins.onap.org/job/sdc-amsterdam-csit-sanity-testng/ws/test/csit/scripts/sdc/kill_and_remove_dataFolder.sh'>
This is <https://jenkins.onap.org/job/sdc-amsterdam-csit-sanity-testng/ws/test/csit/scripts/sdc/kill_and_remove_dataFolder.sh>
++++ docker ps -a -q --filter=name=sdc
+++ docker stop 1d0cada43de1 f8a99c698e3d 56f930941b7d 145530d6c800 78ed8f8f6455
1d0cada43de1
f8a99c698e3d
56f930941b7d
145530d6c800
78ed8f8f6455
++++ docker ps -a -q --filter=name=sdc
+++ docker rm 1d0cada43de1 f8a99c698e3d 56f930941b7d 145530d6c800 78ed8f8f6455
1d0cada43de1
f8a99c698e3d
56f930941b7d
145530d6c800
78ed8f8f6455
+ exit 1
Build step 'Execute shell' marked build as failure
$ ssh-agent -k
unset SSH_AUTH_SOCK;
unset SSH_AGENT_PID;
echo Agent pid 2317 killed;
[ssh-agent] Stopped.
Robot results publisher started...
-Parsing output xml:
Done!
-Copying log files to build dir:
Done!
-Assigning results to build:
Done!
-Checking thresholds:
Done!
Done publishing Robot results.
[PostBuildScript] - Execution post build scripts.
[sdc-amsterdam-csit-sanity-testng] $ /bin/bash /tmp/jenkins8257051711991526396.sh
---> sysstat.sh
grep: /etc/default/sysstat: No such file or directory
provisioning config files...
copy managed file [jenkins-log-archives-settings] to file:<https://jenkins.onap.org/job/sdc-amsterdam-csit-sanity-testng/ws/@tmp/config8508965736041729858tmp>
[EnvInject] - Injecting environment variables from a build step.
[EnvInject] - Injecting as environment variables the properties content
SERVER_ID=logs

[EnvInject] - Variables injected successfully.
[sdc-amsterdam-csit-sanity-testng] $ /bin/bash /tmp/jenkins5611104627161732381.sh
---> create-netrc.sh
[sdc-amsterdam-csit-sanity-testng] $ /bin/bash /tmp/jenkins2474371660993201836.sh
---> lftools-install.sh
lftools, version 0.11.1
---> logs-deploy.sh
+ ARCHIVE_ARTIFACTS=' **/target/surefire-reports/*-output.txt'
+ LOGS_SERVER=https://logs.onap.org
+ '[' https://logs.onap.org == None ']'
+ NEXUS_URL=https://nexus.onap.org
+ NEXUS_PATH=production/vex-yul-ecomp-jenkins-1/sdc-amsterdam-csit-sanity-testng/20
+ BUILD_URL=https://jenkins.onap.org/job/sdc-amsterdam-csit-sanity-testng/20/
+ lftools deploy archives -p ' **/target/surefire-reports/*-output.txt' https://nexus.onap.org production/vex-yul-ecomp-jenkins-1/sdc-amsterdam-csit-sanity-testng/20 <https://jenkins.onap.org/job/sdc-amsterdam-csit-sanity-testng/ws/>
Deploying archives...
/tmp/tmp.FqeIw205mK <https://jenkins.onap.org/job/sdc-amsterdam-csit-sanity-testng/ws/>
<https://jenkins.onap.org/job/sdc-amsterdam-csit-sanity-testng/ws/> /tmp/tmp.FqeIw205mK <https://jenkins.onap.org/job/sdc-amsterdam-csit-sanity-testng/ws/>
/tmp/tmp.FqeIw205mK <https://jenkins.onap.org/job/sdc-amsterdam-csit-sanity-testng/ws/>
304K <https://jenkins.onap.org/job/sdc-amsterdam-csit-sanity-testng/ws/archives.zip>
Pushing archives.log.gz
% Total % Received % Xferd Average Speed Time Time Time Current
Dload Upload Total Spent Left Speed
0 0 0 0 0 0 0 0 --:--:-- --:--:-- --:--:-- 0 0 0 0 0 0 0 0 0 --:--:-- --:--:-- --:--:-- 0100 33 0 0 100 33 0 30 0:00:01 0:00:01 --:--:-- 30
Pushing archives.zip
% Total % Received % Xferd Average Speed Time Time Time Current
Dload Upload Total Spent Left Speed
0 0 0 0 0 0 0 0 --:--:-- --:--:-- --:--:-- 0100 302k 0 0 100 302k 0 1418k --:--:-- --:--:-- --:--:-- 1419k100 302k 0 0 100 302k 0 552k --:--:-- --:--:-- --:--:-- 552k
<https://jenkins.onap.org/job/sdc-amsterdam-csit-sanity-testng/ws/>
+ lftools deploy logs https://nexus.onap.org production/vex-yul-ecomp-jenkins-1/sdc-amsterdam-csit-sanity-testng/20 https://jenkins.onap.org/job/sdc-amsterdam-csit-sanity-testng/20/
Deploying logs...
/tmp/tmp.uL2P8sWVII <https://jenkins.onap.org/job/sdc-amsterdam-csit-sanity-testng/ws/>
build-url: https://jenkins.onap.org/job/sdc-amsterdam-csit-sanity-testng/20/
---> uname -a:
Linux ubuntu1604-docker-8c-8g-8259 4.4.0-59-generic #80-Ubuntu SMP Fri Jan 6 17:47:47 UTC 2017 x86_64 x86_64 x86_64 GNU/Linux

---> lscpu:
Architecture: x86_64
CPU op-mode(s): 32-bit, 64-bit
Byte Order: Little Endian
CPU(s): 8
On-line CPU(s) list: 0-7
Thread(s) per core: 1
Core(s) per socket: 1
Socket(s): 8
NUMA node(s): 1
Vendor ID: GenuineIntel
CPU family: 6
Model: 42
Model name: Intel Xeon E312xx (Sandy Bridge)
Stepping: 1
CPU MHz: 2899.998
BogoMIPS: 5799.99
Hypervisor vendor: KVM
Virtualization type: full
L1d cache: 32K
L1i cache: 32K
L2 cache: 4096K
NUMA node0 CPU(s): 0-7
Flags: fpu vme de pse tsc msr pae mce cx8 apic sep mtrr pge mca cmov pat pse36 clflush mmx fxsr sse sse2 ss syscall nx pdpe1gb rdtscp lm constant_tsc rep_good nopl eagerfpu pni pclmulqdq ssse3 cx16 pcid sse4_1 sse4_2 x2apic popcnt tsc_deadline_timer aes xsave avx hypervisor lahf_lm xsaveopt arat

---> nproc:
8

---> df -h:
Filesystem Size Used Avail Use% Mounted on
udev 3.9G 0 3.9G 0% /dev
tmpfs 799M 8.7M 790M 2% /run
/dev/vda1 194G 7.9G 186G 5% /
tmpfs 3.9G 0 3.9G 0% /dev/shm
tmpfs 5.0M 0 5.0M 0% /run/lock
tmpfs 3.9G 0 3.9G 0% /sys/fs/cgroup
tmpfs 799M 0 799M 0% /run/user/1001

---> free -m:
total used free shared buff/cache available
Mem: 7982 493 6655 8 833 7150
Swap: 0 0 0

---> ip addr:
1: lo: <LOOPBACK,UP,LOWER_UP> mtu 65536 qdisc noqueue state UNKNOWN group default qlen 1
link/loopback 00:00:00:00:00:00 brd 00:00:00:00:00:00
inet 127.0.0.1/8 scope host lo
valid_lft forever preferred_lft forever
inet6 ::1/128 scope host
valid_lft forever preferred_lft forever
2: ens3: <BROADCAST,MULTICAST,UP,LOWER_UP> mtu 1458 qdisc pfifo_fast state UP group default qlen 1000
link/ether fa:16:3e:4b:be:91 brd ff:ff:ff:ff:ff:ff
inet 10.30.106.14/23 brd 10.30.107.255 scope global ens3
valid_lft forever preferred_lft forever
inet6 fe80::f816:3eff:fe4b:be91/64 scope link
valid_lft forever preferred_lft forever
3: docker0: <NO-CARRIER,BROADCAST,MULTICAST,UP> mtu 1500 qdisc noqueue state DOWN group default
link/ether 02:42:14:0f:7b:71 brd ff:ff:ff:ff:ff:ff
inet 172.17.0.1/16 scope global docker0
valid_lft forever preferred_lft forever
inet6 fe80::42:14ff:fe0f:7b71/64 scope link
valid_lft forever preferred_lft forever

-----END_OF_BUILD-----
2018-01-16 16:39:47 URL:https://jenkins.onap.org/job/sdc-amsterdam-csit-sanity-testng/20/consoleText [104734] -> "console.log" [1]
2018-01-16 16:39:48 URL:https://jenkins.onap.org/job/sdc-amsterdam-csit-sanity-testng/20/timestamps/?time=HH:mm:ss&appendLog [128036] -> "console-timestamp.log" [1]
adding: _build-details.log.gz (stored 0%)
adding: _build-enviroment-variables.log.gz (stored 0%)
adding: console.log.gz (deflated 1%)
adding: console-timestamp.log.gz (deflated 2%)
adding: _sys-info.log.gz (stored 0%)
% Total % Received % Xferd Average Speed Time Time Time Current
Dload Upload Total Spent Left Speed
0 0 0 0 0 0 0 0 --:--:-- --:--:-- --:--:-- 0 0 0 0 0 0 0 0 0 --:--:-- 0:00:01 --:--:-- 0100 42744 0 0 100 42744 0 37029 0:00:01 0:00:01 --:--:-- 37039
<https://jenkins.onap.org/job/sdc-amsterdam-csit-sanity-testng/ws/>
+ set +x
Build logs: <a href="https://logs.onap.org/production/vex-yul-ecomp-jenkins-1/sdc-amsterdam-csit-sanity-testng/20">https://logs.onap.org/production/vex-yul-ecomp-jenkins-1/sdc-amsterdam-csit-sanity-testng/20</a>
[sdc-amsterdam-csit-sanity-testng] $ /bin/bash /tmp/jenkins2904278385599475557.sh
[description-setter] Description set: Build logs: <a href="https://logs.onap.org/production/vex-yul-ecomp-jenkins-1/sdc-amsterdam-csit-sanity-testng/20">https://logs.onap.org/production/vex-yul-ecomp-jenkins-1/sdc-amsterdam-csit-sanity-testng/20</a>
TestNG Reports Processing: START
Looking for TestNG results report in workspace using pattern: archives/testng-results.xml
Did not find any matching files.
Recording test results
ERROR: Step ‘Publish JUnit test result report’ failed: No test report files were found. Configuration error?


[sdc] sdc-amsterdam-csit-sanity-testng - Build # 19 - Still Failing!

Jenkins <donotreply@...>
 

sdc-amsterdam-csit-sanity-testng - Build # 19 - Still Failing:

Please refer to the logs server URL for console logs when possible
and use the Jenkins Build URL as a last resort.

Console Logs URL:
https://logs.onap.org/production/vex-yul-ecomp-jenkins-1/sdc-amsterdam-csit-sanity-testng/19

Jenkins Build URL:
https://jenkins.onap.org/job/sdc-amsterdam-csit-sanity-testng/19/


Build failed in Jenkins: sdc-amsterdam-csit-sanity-testng #19

Jenkins <donotreply@...>
 

See <https://jenkins.onap.org/job/sdc-amsterdam-csit-sanity-testng/19/display/redirect>

------------------------------------------
[...truncated 91.68 KB...]
+ SUITES=<https://jenkins.onap.org/job/sdc-amsterdam-csit-sanity-testng/ws/test/csit/tests/sdc/sanity>
+ echo ROBOT_VARIABLES=-v BE_IP:172.17.0.4
ROBOT_VARIABLES=-v BE_IP:172.17.0.4
+ echo 'Starting Robot test suites <https://jenkins.onap.org/job/sdc-amsterdam-csit-sanity-testng/ws/test/csit/tests/sdc/sanity> ...'
Starting Robot test suites <https://jenkins.onap.org/job/sdc-amsterdam-csit-sanity-testng/ws/test/csit/tests/sdc/sanity> ...
+ set +e
+ pybot -N plans/sdc/sanity -v WORKSPACE:/tmp -v BE_IP:172.17.0.4 <https://jenkins.onap.org/job/sdc-amsterdam-csit-sanity-testng/ws/test/csit/tests/sdc/sanity>
==============================================================================
plans/sdc/sanity :: Sdc - HealthCheck
==============================================================================
plans/sdc/sanity.Test1
==============================================================================
Get Requests health check ok | FAIL |
500 != 200
------------------------------------------------------------------------------
plans/sdc/sanity.Test1 | FAIL |
1 critical test, 0 passed, 1 failed
1 test total, 0 passed, 1 failed
==============================================================================
plans/sdc/sanity :: Sdc - HealthCheck | FAIL |
1 critical test, 0 passed, 1 failed
1 test total, 0 passed, 1 failed
==============================================================================
Output: /tmp/tmp.LiNe7nqBIt-robot-workdir/output.xml
Log: /tmp/tmp.LiNe7nqBIt-robot-workdir/log.html
Report: /tmp/tmp.LiNe7nqBIt-robot-workdir/report.html
+ RESULT=1
+ set -e
+ echo 'RESULT: ' 1
RESULT: 1
+ rsync -av /tmp/tmp.LiNe7nqBIt-robot-workdir/ <https://jenkins.onap.org/job/sdc-amsterdam-csit-sanity-testng/ws/archives>
sending incremental file list
./
log.html
output.xml
report.html
testplan.txt

sent 422,931 bytes received 95 bytes 846,052.00 bytes/sec
total size is 422,506 speedup is 1.00
+ docker ps --format '{{.Image}}'
+ docker_stats
+ echo '> top -bn1 | head -3'
+ tee <https://jenkins.onap.org/job/sdc-amsterdam-csit-sanity-testng/ws/archives/_sysinfo-2-after-robot.txt>
+ top -bn1
+ head -3
top -bn1 | head -3
top - 15:53:13 up 23 min, 0 users, load average: 1.77, 1.28, 1.03
Tasks: 206 total, 1 running, 205 sleeping, 0 stopped, 0 zombie
%Cpu(s): 7.9 us, 1.8 sy, 0.1 ni, 84.3 id, 4.9 wa, 0.0 hi, 0.1 si, 0.9 st
+ echo
+ echo '> free -h'
+ free -h

free -h
total used free shared buff/cache available
Mem: 7.8G 6.3G 827M 8.9M 681M 1.1G
Swap: 0B 0B 0B
+ echo
+ echo '> docker ps'
+ docker ps

docker ps
CONTAINER ID IMAGE COMMAND CREATED STATUS PORTS NAMES
4ade50d03d0e nexus3.onap.org:10001/openecomp/sdc-frontend:1.1.1-STAGING-latest "/root/startup.sh" 3 minutes ago Up 3 minutes 0.0.0.0:8181->8181/tcp, 8080/tcp, 0.0.0.0:9443->9443/tcp sdc-FE
dcce02071f63 nexus3.onap.org:10001/openecomp/sdc-backend:1.1.1-STAGING-latest "/root/startup.sh" 11 minutes ago Up 11 minutes 0.0.0.0:8080->8080/tcp, 0.0.0.0:8443->8443/tcp sdc-BE
ac3ddcab64e0 nexus3.onap.org:10001/openecomp/sdc-cassandra:1.1.1-STAGING-latest "/root/startup.sh" 18 minutes ago Up 17 minutes 7000-7001/tcp, 0.0.0.0:9042->9042/tcp, 7199/tcp, 0.0.0.0:9160->9160/tcp sdc-cs
4eba787ffffd nexus3.onap.org:10001/openecomp/sdc-elasticsearch:1.1.1-STAGING-latest "/root/startup.sh" 19 minutes ago Up 19 minutes 0.0.0.0:9200->9200/tcp, 0.0.0.0:9300->9300/tcp sdc-es
+ echo
+ echo '> docker stats --no-stream'
+ docker stats --no-stream

docker stats --no-stream
CONTAINER CPU % MEM USAGE / LIMIT MEM % NET I/O BLOCK I/O PIDS
4ade50d03d0e 1.38% 869.3 MiB / 2 GiB 42.45% 111.1 kB / 72.23 kB 8.794 MB / 315.4 kB 50
dcce02071f63 13.30% 2.291 GiB / 4 GiB 57.28% 68.95 MB / 25.79 MB 40.01 MB / 1.499 MB 128
ac3ddcab64e0 1.10% 2.261 GiB / 7.796 GiB 29.00% 24.91 MB / 68.65 MB 708.6 kB / 295.1 MB 114
4eba787ffffd 0.45% 515.3 MiB / 1 GiB 50.33% 386.9 kB / 249.5 kB 5.009 MB / 2.273 MB 102
+ echo

+ cd <https://jenkins.onap.org/job/sdc-amsterdam-csit-sanity-testng/ws/test/csit/plans/sdc/sanity>
+ TEARDOWN=<https://jenkins.onap.org/job/sdc-amsterdam-csit-sanity-testng/ws/test/csit/plans/sdc/sanity/teardown.sh>
+ '[' -f <https://jenkins.onap.org/job/sdc-amsterdam-csit-sanity-testng/ws/test/csit/plans/sdc/sanity/teardown.sh> ']'
+ echo 'Running teardown script <https://jenkins.onap.org/job/sdc-amsterdam-csit-sanity-testng/ws/test/csit/plans/sdc/sanity/teardown.sh'>
Running teardown script <https://jenkins.onap.org/job/sdc-amsterdam-csit-sanity-testng/ws/test/csit/plans/sdc/sanity/teardown.sh>
+ source <https://jenkins.onap.org/job/sdc-amsterdam-csit-sanity-testng/ws/test/csit/plans/sdc/sanity/teardown.sh>
++ source <https://jenkins.onap.org/job/sdc-amsterdam-csit-sanity-testng/ws/test/csit/scripts/sdc/kill_containers_and_remove_dataFolders.sh>
+++ echo 'This is <https://jenkins.onap.org/job/sdc-amsterdam-csit-sanity-testng/ws/test/csit/scripts/sdc/kill_and_remove_dataFolder.sh'>
This is <https://jenkins.onap.org/job/sdc-amsterdam-csit-sanity-testng/ws/test/csit/scripts/sdc/kill_and_remove_dataFolder.sh>
++++ docker ps -a -q --filter=name=sdc
+++ docker stop 29b5cab7f7d8 4ade50d03d0e dcce02071f63 ac3ddcab64e0 4eba787ffffd
29b5cab7f7d8
4ade50d03d0e
dcce02071f63
ac3ddcab64e0
4eba787ffffd
++++ docker ps -a -q --filter=name=sdc
+++ docker rm 29b5cab7f7d8 4ade50d03d0e dcce02071f63 ac3ddcab64e0 4eba787ffffd
29b5cab7f7d8
4ade50d03d0e
dcce02071f63
ac3ddcab64e0
4eba787ffffd
+ exit 1
Build step 'Execute shell' marked build as failure
$ ssh-agent -k
unset SSH_AUTH_SOCK;
unset SSH_AGENT_PID;
echo Agent pid 2310 killed;
[ssh-agent] Stopped.
Robot results publisher started...
-Parsing output xml:
Done!
-Copying log files to build dir:
Done!
-Assigning results to build:
Done!
-Checking thresholds:
Done!
Done publishing Robot results.
[PostBuildScript] - Execution post build scripts.
[sdc-amsterdam-csit-sanity-testng] $ /bin/bash /tmp/jenkins2322185403759073971.sh
---> sysstat.sh
grep: /etc/default/sysstat: No such file or directory
provisioning config files...
copy managed file [jenkins-log-archives-settings] to file:<https://jenkins.onap.org/job/sdc-amsterdam-csit-sanity-testng/ws/@tmp/config37839515799066328tmp>
[EnvInject] - Injecting environment variables from a build step.
[EnvInject] - Injecting as environment variables the properties content
SERVER_ID=logs

[EnvInject] - Variables injected successfully.
[sdc-amsterdam-csit-sanity-testng] $ /bin/bash /tmp/jenkins4121401611772817591.sh
---> create-netrc.sh
[sdc-amsterdam-csit-sanity-testng] $ /bin/bash /tmp/jenkins1643642663537338956.sh
---> lftools-install.sh
lftools, version 0.11.1
---> logs-deploy.sh
+ ARCHIVE_ARTIFACTS=' **/target/surefire-reports/*-output.txt'
+ LOGS_SERVER=https://logs.onap.org
+ '[' https://logs.onap.org == None ']'
+ NEXUS_URL=https://nexus.onap.org
+ NEXUS_PATH=production/vex-yul-ecomp-jenkins-1/sdc-amsterdam-csit-sanity-testng/19
+ BUILD_URL=https://jenkins.onap.org/job/sdc-amsterdam-csit-sanity-testng/19/
+ lftools deploy archives -p ' **/target/surefire-reports/*-output.txt' https://nexus.onap.org production/vex-yul-ecomp-jenkins-1/sdc-amsterdam-csit-sanity-testng/19 <https://jenkins.onap.org/job/sdc-amsterdam-csit-sanity-testng/ws/>
Deploying archives...
/tmp/tmp.xaDlejC54w <https://jenkins.onap.org/job/sdc-amsterdam-csit-sanity-testng/ws/>
<https://jenkins.onap.org/job/sdc-amsterdam-csit-sanity-testng/ws/> /tmp/tmp.xaDlejC54w <https://jenkins.onap.org/job/sdc-amsterdam-csit-sanity-testng/ws/>
/tmp/tmp.xaDlejC54w <https://jenkins.onap.org/job/sdc-amsterdam-csit-sanity-testng/ws/>
288K <https://jenkins.onap.org/job/sdc-amsterdam-csit-sanity-testng/ws/archives.zip>
Pushing archives.log.gz
% Total % Received % Xferd Average Speed Time Time Time Current
Dload Upload Total Spent Left Speed
0 0 0 0 0 0 0 0 --:--:-- --:--:-- --:--:-- 0 0 0 0 0 0 0 0 0 --:--:-- --:--:-- --:--:-- 0100 33 0 0 100 33 0 40 --:--:-- --:--:-- --:--:-- 40
Pushing archives.zip
% Total % Received % Xferd Average Speed Time Time Time Current
Dload Upload Total Spent Left Speed
0 0 0 0 0 0 0 0 --:--:-- --:--:-- --:--:-- 0100 287k 0 0 100 287k 0 493k --:--:-- --:--:-- --:--:-- 493k100 287k 0 0 100 287k 0 492k --:--:-- --:--:-- --:--:-- 492k
<https://jenkins.onap.org/job/sdc-amsterdam-csit-sanity-testng/ws/>
+ lftools deploy logs https://nexus.onap.org production/vex-yul-ecomp-jenkins-1/sdc-amsterdam-csit-sanity-testng/19 https://jenkins.onap.org/job/sdc-amsterdam-csit-sanity-testng/19/
Deploying logs...
/tmp/tmp.t4h4QmqRUe <https://jenkins.onap.org/job/sdc-amsterdam-csit-sanity-testng/ws/>
build-url: https://jenkins.onap.org/job/sdc-amsterdam-csit-sanity-testng/19/
---> uname -a:
Linux ubuntu1604-docker-8c-8g-6259 4.4.0-59-generic #80-Ubuntu SMP Fri Jan 6 17:47:47 UTC 2017 x86_64 x86_64 x86_64 GNU/Linux

---> lscpu:
Architecture: x86_64
CPU op-mode(s): 32-bit, 64-bit
Byte Order: Little Endian
CPU(s): 8
On-line CPU(s) list: 0-7
Thread(s) per core: 1
Core(s) per socket: 1
Socket(s): 8
NUMA node(s): 1
Vendor ID: GenuineIntel
CPU family: 6
Model: 42
Model name: Intel Xeon E312xx (Sandy Bridge)
Stepping: 1
CPU MHz: 2899.998
BogoMIPS: 5799.99
Hypervisor vendor: KVM
Virtualization type: full
L1d cache: 32K
L1i cache: 32K
L2 cache: 4096K
NUMA node0 CPU(s): 0-7
Flags: fpu vme de pse tsc msr pae mce cx8 apic sep mtrr pge mca cmov pat pse36 clflush mmx fxsr sse sse2 ss syscall nx pdpe1gb rdtscp lm constant_tsc rep_good nopl eagerfpu pni pclmulqdq ssse3 cx16 pcid sse4_1 sse4_2 x2apic popcnt tsc_deadline_timer aes xsave avx hypervisor lahf_lm xsaveopt arat

---> nproc:
8

---> df -h:
Filesystem Size Used Avail Use% Mounted on
udev 3.9G 0 3.9G 0% /dev
tmpfs 799M 8.7M 790M 2% /run
/dev/vda1 194G 7.8G 187G 5% /
tmpfs 3.9G 0 3.9G 0% /dev/shm
tmpfs 5.0M 0 5.0M 0% /run/lock
tmpfs 3.9G 0 3.9G 0% /sys/fs/cgroup
tmpfs 799M 0 799M 0% /run/user/1001

---> free -m:
total used free shared buff/cache available
Mem: 7982 513 6710 8 758 7129
Swap: 0 0 0

---> ip addr:
1: lo: <LOOPBACK,UP,LOWER_UP> mtu 65536 qdisc noqueue state UNKNOWN group default qlen 1
link/loopback 00:00:00:00:00:00 brd 00:00:00:00:00:00
inet 127.0.0.1/8 scope host lo
valid_lft forever preferred_lft forever
inet6 ::1/128 scope host
valid_lft forever preferred_lft forever
2: ens3: <BROADCAST,MULTICAST,UP,LOWER_UP> mtu 1458 qdisc pfifo_fast state UP group default qlen 1000
link/ether fa:16:3e:f0:23:fc brd ff:ff:ff:ff:ff:ff
inet 10.30.106.26/23 brd 10.30.107.255 scope global ens3
valid_lft forever preferred_lft forever
inet6 fe80::f816:3eff:fef0:23fc/64 scope link
valid_lft forever preferred_lft forever
3: docker0: <NO-CARRIER,BROADCAST,MULTICAST,UP> mtu 1500 qdisc noqueue state DOWN group default
link/ether 02:42:0e:0d:3d:10 brd ff:ff:ff:ff:ff:ff
inet 172.17.0.1/16 scope global docker0
valid_lft forever preferred_lft forever
inet6 fe80::42:eff:fe0d:3d10/64 scope link
valid_lft forever preferred_lft forever

-----END_OF_BUILD-----
2018-01-15 15:54:23 URL:https://jenkins.onap.org/job/sdc-amsterdam-csit-sanity-testng/19/consoleText [105702] -> "console.log" [1]
2018-01-15 15:54:23 URL:https://jenkins.onap.org/job/sdc-amsterdam-csit-sanity-testng/19/timestamps/?time=HH:mm:ss&appendLog [129224] -> "console-timestamp.log" [1]
adding: _build-details.log.gz (stored 0%)
adding: _build-enviroment-variables.log.gz (stored 0%)
adding: console.log.gz (deflated 1%)
adding: console-timestamp.log.gz (deflated 2%)
adding: _sys-info.log.gz (stored 0%)
% Total % Received % Xferd Average Speed Time Time Time Current
Dload Upload Total Spent Left Speed
0 0 0 0 0 0 0 0 --:--:-- --:--:-- --:--:-- 0100 42428 0 0 100 42428 0 166k --:--:-- --:--:-- --:--:-- 167k
<https://jenkins.onap.org/job/sdc-amsterdam-csit-sanity-testng/ws/>
+ set +x
Build logs: <a href="https://logs.onap.org/production/vex-yul-ecomp-jenkins-1/sdc-amsterdam-csit-sanity-testng/19">https://logs.onap.org/production/vex-yul-ecomp-jenkins-1/sdc-amsterdam-csit-sanity-testng/19</a>
[sdc-amsterdam-csit-sanity-testng] $ /bin/bash /tmp/jenkins2586168882077733374.sh
[description-setter] Description set: Build logs: <a href="https://logs.onap.org/production/vex-yul-ecomp-jenkins-1/sdc-amsterdam-csit-sanity-testng/19">https://logs.onap.org/production/vex-yul-ecomp-jenkins-1/sdc-amsterdam-csit-sanity-testng/19</a>
TestNG Reports Processing: START
Looking for TestNG results report in workspace using pattern: archives/testng-results.xml
Did not find any matching files.
Recording test results
ERROR: Step ‘Publish JUnit test result report’ failed: No test report files were found. Configuration error?


[sdc] sdc-amsterdam-csit-sanity-testng - Build # 18 - Still Failing!

Jenkins <donotreply@...>
 

sdc-amsterdam-csit-sanity-testng - Build # 18 - Still Failing:

Please refer to the logs server URL for console logs when possible
and use the Jenkins Build URL as a last resort.

Console Logs URL:
https://logs.onap.org/production/vex-yul-ecomp-jenkins-1/sdc-amsterdam-csit-sanity-testng/18

Jenkins Build URL:
https://jenkins.onap.org/job/sdc-amsterdam-csit-sanity-testng/18/


Build failed in Jenkins: sdc-amsterdam-csit-sanity-testng #18

Jenkins <donotreply@...>
 

See <https://jenkins.onap.org/job/sdc-amsterdam-csit-sanity-testng/18/display/redirect>

------------------------------------------
[...truncated 90.75 KB...]
+ SUITES=<https://jenkins.onap.org/job/sdc-amsterdam-csit-sanity-testng/ws/test/csit/tests/sdc/sanity>
+ echo ROBOT_VARIABLES=-v BE_IP:172.17.0.4
ROBOT_VARIABLES=-v BE_IP:172.17.0.4
+ echo 'Starting Robot test suites <https://jenkins.onap.org/job/sdc-amsterdam-csit-sanity-testng/ws/test/csit/tests/sdc/sanity> ...'
Starting Robot test suites <https://jenkins.onap.org/job/sdc-amsterdam-csit-sanity-testng/ws/test/csit/tests/sdc/sanity> ...
+ set +e
+ pybot -N plans/sdc/sanity -v WORKSPACE:/tmp -v BE_IP:172.17.0.4 <https://jenkins.onap.org/job/sdc-amsterdam-csit-sanity-testng/ws/test/csit/tests/sdc/sanity>
==============================================================================
plans/sdc/sanity :: Sdc - HealthCheck
==============================================================================
plans/sdc/sanity.Test1
==============================================================================
Get Requests health check ok | FAIL |
500 != 200
------------------------------------------------------------------------------
plans/sdc/sanity.Test1 | FAIL |
1 critical test, 0 passed, 1 failed
1 test total, 0 passed, 1 failed
==============================================================================
plans/sdc/sanity :: Sdc - HealthCheck | FAIL |
1 critical test, 0 passed, 1 failed
1 test total, 0 passed, 1 failed
==============================================================================
Output: /tmp/tmp.qCC6535Dox-robot-workdir/output.xml
Log: /tmp/tmp.qCC6535Dox-robot-workdir/log.html
Report: /tmp/tmp.qCC6535Dox-robot-workdir/report.html
+ RESULT=1
+ set -e
+ echo 'RESULT: ' 1
RESULT: 1
+ rsync -av /tmp/tmp.qCC6535Dox-robot-workdir/ <https://jenkins.onap.org/job/sdc-amsterdam-csit-sanity-testng/ws/archives>
sending incremental file list
./
log.html
output.xml
report.html
testplan.txt

sent 422,931 bytes received 95 bytes 846,052.00 bytes/sec
total size is 422,506 speedup is 1.00
+ docker ps --format '{{.Image}}'
+ docker_stats
+ echo '> top -bn1 | head -3'
+ tee <https://jenkins.onap.org/job/sdc-amsterdam-csit-sanity-testng/ws/archives/_sysinfo-2-after-robot.txt>
+ top -bn1
+ head -3
top -bn1 | head -3
top - 15:49:14 up 19 min, 0 users, load average: 2.64, 1.71, 1.05
Tasks: 207 total, 1 running, 206 sleeping, 0 stopped, 0 zombie
%Cpu(s): 8.2 us, 2.0 sy, 0.1 ni, 85.4 id, 3.6 wa, 0.0 hi, 0.1 si, 0.6 st
+ echo
+ echo '> free -h'
+ free -h

free -h
total used free shared buff/cache available
Mem: 7.8G 6.1G 854M 8.9M 880M 1.3G
Swap: 0B 0B 0B
+ echo
+ echo '> docker ps'

docker ps
+ docker ps
CONTAINER ID IMAGE COMMAND CREATED STATUS PORTS NAMES
aff445856d82 nexus3.onap.org:10001/openecomp/sdc-frontend:1.1.1-STAGING-latest "/root/startup.sh" 3 minutes ago Up 3 minutes 0.0.0.0:8181->8181/tcp, 8080/tcp, 0.0.0.0:9443->9443/tcp sdc-FE
ea0fcee1bd90 nexus3.onap.org:10001/openecomp/sdc-backend:1.1.1-STAGING-latest "/root/startup.sh" 11 minutes ago Up 11 minutes 0.0.0.0:8080->8080/tcp, 0.0.0.0:8443->8443/tcp sdc-BE
c3c86cdab142 nexus3.onap.org:10001/openecomp/sdc-cassandra:1.1.1-STAGING-latest "/root/startup.sh" 16 minutes ago Up 16 minutes 7000-7001/tcp, 0.0.0.0:9042->9042/tcp, 7199/tcp, 0.0.0.0:9160->9160/tcp sdc-cs
199265363a5b nexus3.onap.org:10001/openecomp/sdc-elasticsearch:1.1.1-STAGING-latest "/root/startup.sh" 17 minutes ago Up 17 minutes 0.0.0.0:9200->9200/tcp, 0.0.0.0:9300->9300/tcp sdc-es
+ echo

+ echo '> docker stats --no-stream'
+ docker stats --no-stream
docker stats --no-stream
CONTAINER CPU % MEM USAGE / LIMIT MEM % NET I/O BLOCK I/O PIDS
aff445856d82 0.19% 866 MiB / 2 GiB 42.29% 102.2 kB / 70.23 kB 3.125 MB / 315.4 kB 51
ea0fcee1bd90 6.86% 2.057 GiB / 4 GiB 51.43% 68.09 MB / 25.9 MB 36.15 MB / 21.83 MB 148
c3c86cdab142 2.78% 2.308 GiB / 7.796 GiB 29.60% 25.06 MB / 67.86 MB 692.2 kB / 315.5 MB 114
199265363a5b 0.95% 521.5 MiB / 1 GiB 50.93% 385.3 kB / 244.6 kB 3.74 MB / 3.944 MB 102
+ echo

+ cd <https://jenkins.onap.org/job/sdc-amsterdam-csit-sanity-testng/ws/test/csit/plans/sdc/sanity>
+ TEARDOWN=<https://jenkins.onap.org/job/sdc-amsterdam-csit-sanity-testng/ws/test/csit/plans/sdc/sanity/teardown.sh>
+ '[' -f <https://jenkins.onap.org/job/sdc-amsterdam-csit-sanity-testng/ws/test/csit/plans/sdc/sanity/teardown.sh> ']'
+ echo 'Running teardown script <https://jenkins.onap.org/job/sdc-amsterdam-csit-sanity-testng/ws/test/csit/plans/sdc/sanity/teardown.sh'>
Running teardown script <https://jenkins.onap.org/job/sdc-amsterdam-csit-sanity-testng/ws/test/csit/plans/sdc/sanity/teardown.sh>
+ source <https://jenkins.onap.org/job/sdc-amsterdam-csit-sanity-testng/ws/test/csit/plans/sdc/sanity/teardown.sh>
++ source <https://jenkins.onap.org/job/sdc-amsterdam-csit-sanity-testng/ws/test/csit/scripts/sdc/kill_containers_and_remove_dataFolders.sh>
+++ echo 'This is <https://jenkins.onap.org/job/sdc-amsterdam-csit-sanity-testng/ws/test/csit/scripts/sdc/kill_and_remove_dataFolder.sh'>
This is <https://jenkins.onap.org/job/sdc-amsterdam-csit-sanity-testng/ws/test/csit/scripts/sdc/kill_and_remove_dataFolder.sh>
++++ docker ps -a -q --filter=name=sdc
+++ docker stop e32514a21ee3 aff445856d82 ea0fcee1bd90 c3c86cdab142 199265363a5b
e32514a21ee3
aff445856d82
ea0fcee1bd90
c3c86cdab142
199265363a5b
++++ docker ps -a -q --filter=name=sdc
+++ docker rm e32514a21ee3 aff445856d82 ea0fcee1bd90 c3c86cdab142 199265363a5b
e32514a21ee3
aff445856d82
ea0fcee1bd90
c3c86cdab142
199265363a5b
+ exit 1
Build step 'Execute shell' marked build as failure
$ ssh-agent -k
unset SSH_AUTH_SOCK;
unset SSH_AGENT_PID;
echo Agent pid 2299 killed;
[ssh-agent] Stopped.
Robot results publisher started...
-Parsing output xml:
Done!
-Copying log files to build dir:
Done!
-Assigning results to build:
Done!
-Checking thresholds:
Done!
Done publishing Robot results.
[PostBuildScript] - Execution post build scripts.
[sdc-amsterdam-csit-sanity-testng] $ /bin/bash /tmp/jenkins5439819964424498196.sh
---> sysstat.sh
grep: /etc/default/sysstat: No such file or directory
provisioning config files...
copy managed file [jenkins-log-archives-settings] to file:<https://jenkins.onap.org/job/sdc-amsterdam-csit-sanity-testng/ws/@tmp/config4247096055571207729tmp>
[EnvInject] - Injecting environment variables from a build step.
[EnvInject] - Injecting as environment variables the properties content
SERVER_ID=logs

[EnvInject] - Variables injected successfully.
[sdc-amsterdam-csit-sanity-testng] $ /bin/bash /tmp/jenkins6230439634022108202.sh
---> create-netrc.sh
[sdc-amsterdam-csit-sanity-testng] $ /bin/bash /tmp/jenkins5006815148923961332.sh
---> lftools-install.sh
lftools, version 0.11.1
---> logs-deploy.sh
+ ARCHIVE_ARTIFACTS=' **/target/surefire-reports/*-output.txt'
+ LOGS_SERVER=https://logs.onap.org
+ '[' https://logs.onap.org == None ']'
+ NEXUS_URL=https://nexus.onap.org
+ NEXUS_PATH=production/vex-yul-ecomp-jenkins-1/sdc-amsterdam-csit-sanity-testng/18
+ BUILD_URL=https://jenkins.onap.org/job/sdc-amsterdam-csit-sanity-testng/18/
+ lftools deploy archives -p ' **/target/surefire-reports/*-output.txt' https://nexus.onap.org production/vex-yul-ecomp-jenkins-1/sdc-amsterdam-csit-sanity-testng/18 <https://jenkins.onap.org/job/sdc-amsterdam-csit-sanity-testng/ws/>
Deploying archives...
/tmp/tmp.ujnWCfPYVf <https://jenkins.onap.org/job/sdc-amsterdam-csit-sanity-testng/ws/>
<https://jenkins.onap.org/job/sdc-amsterdam-csit-sanity-testng/ws/> /tmp/tmp.ujnWCfPYVf <https://jenkins.onap.org/job/sdc-amsterdam-csit-sanity-testng/ws/>
/tmp/tmp.ujnWCfPYVf <https://jenkins.onap.org/job/sdc-amsterdam-csit-sanity-testng/ws/>
288K <https://jenkins.onap.org/job/sdc-amsterdam-csit-sanity-testng/ws/archives.zip>
Pushing archives.log.gz
% Total % Received % Xferd Average Speed Time Time Time Current
Dload Upload Total Spent Left Speed
0 0 0 0 0 0 0 0 --:--:-- --:--:-- --:--:-- 0100 33 0 0 100 33 0 60 --:--:-- --:--:-- --:--:-- 60
Pushing archives.zip
% Total % Received % Xferd Average Speed Time Time Time Current
Dload Upload Total Spent Left Speed
0 0 0 0 0 0 0 0 --:--:-- --:--:-- --:--:-- 0 0 0 0 0 0 0 0 0 --:--:-- --:--:-- --:--:-- 0100 286k 0 0 100 286k 0 358k --:--:-- --:--:-- --:--:-- 357k
<https://jenkins.onap.org/job/sdc-amsterdam-csit-sanity-testng/ws/>
+ lftools deploy logs https://nexus.onap.org production/vex-yul-ecomp-jenkins-1/sdc-amsterdam-csit-sanity-testng/18 https://jenkins.onap.org/job/sdc-amsterdam-csit-sanity-testng/18/
Deploying logs...
/tmp/tmp.DEPWtDlFFu <https://jenkins.onap.org/job/sdc-amsterdam-csit-sanity-testng/ws/>
build-url: https://jenkins.onap.org/job/sdc-amsterdam-csit-sanity-testng/18/
---> uname -a:
Linux ubuntu1604-docker-8c-8g-390 4.4.0-59-generic #80-Ubuntu SMP Fri Jan 6 17:47:47 UTC 2017 x86_64 x86_64 x86_64 GNU/Linux

---> lscpu:
Architecture: x86_64
CPU op-mode(s): 32-bit, 64-bit
Byte Order: Little Endian
CPU(s): 8
On-line CPU(s) list: 0-7
Thread(s) per core: 1
Core(s) per socket: 1
Socket(s): 8
NUMA node(s): 1
Vendor ID: GenuineIntel
CPU family: 6
Model: 42
Model name: Intel Xeon E312xx (Sandy Bridge)
Stepping: 1
CPU MHz: 2899.998
BogoMIPS: 5799.99
Hypervisor vendor: KVM
Virtualization type: full
L1d cache: 32K
L1i cache: 32K
L2 cache: 4096K
NUMA node0 CPU(s): 0-7
Flags: fpu vme de pse tsc msr pae mce cx8 apic sep mtrr pge mca cmov pat pse36 clflush mmx fxsr sse sse2 ss syscall nx pdpe1gb rdtscp lm constant_tsc rep_good nopl eagerfpu pni pclmulqdq ssse3 cx16 pcid sse4_1 sse4_2 x2apic popcnt tsc_deadline_timer aes xsave avx hypervisor lahf_lm xsaveopt arat

---> nproc:
8

---> df -h:
Filesystem Size Used Avail Use% Mounted on
udev 3.9G 0 3.9G 0% /dev
tmpfs 799M 8.7M 790M 2% /run
/dev/vda1 194G 7.8G 187G 5% /
tmpfs 3.9G 0 3.9G 0% /dev/shm
tmpfs 5.0M 0 5.0M 0% /run/lock
tmpfs 3.9G 0 3.9G 0% /sys/fs/cgroup
tmpfs 799M 0 799M 0% /run/user/1001

---> free -m:
total used free shared buff/cache available
Mem: 7982 489 6568 8 924 7153
Swap: 0 0 0

---> ip addr:
1: lo: <LOOPBACK,UP,LOWER_UP> mtu 65536 qdisc noqueue state UNKNOWN group default qlen 1
link/loopback 00:00:00:00:00:00 brd 00:00:00:00:00:00
inet 127.0.0.1/8 scope host lo
valid_lft forever preferred_lft forever
inet6 ::1/128 scope host
valid_lft forever preferred_lft forever
2: ens3: <BROADCAST,MULTICAST,UP,LOWER_UP> mtu 1458 qdisc pfifo_fast state UP group default qlen 1000
link/ether fa:16:3e:e5:13:93 brd ff:ff:ff:ff:ff:ff
inet 10.30.106.23/23 brd 10.30.107.255 scope global ens3
valid_lft forever preferred_lft forever
inet6 fe80::f816:3eff:fee5:1393/64 scope link
valid_lft forever preferred_lft forever
3: docker0: <NO-CARRIER,BROADCAST,MULTICAST,UP> mtu 1500 qdisc noqueue state DOWN group default
link/ether 02:42:5f:4f:6e:29 brd ff:ff:ff:ff:ff:ff
inet 172.17.0.1/16 scope global docker0
valid_lft forever preferred_lft forever
inet6 fe80::42:5fff:fe4f:6e29/64 scope link
valid_lft forever preferred_lft forever

-----END_OF_BUILD-----
2018-01-14 15:50:22 URL:https://jenkins.onap.org/job/sdc-amsterdam-csit-sanity-testng/18/consoleText [104669] -> "console.log" [1]
2018-01-14 15:50:22 URL:https://jenkins.onap.org/job/sdc-amsterdam-csit-sanity-testng/18/timestamps/?time=HH:mm:ss&appendLog [128021] -> "console-timestamp.log" [1]
adding: _build-details.log.gz (stored 0%)
adding: _build-enviroment-variables.log.gz (stored 0%)
adding: console.log.gz (deflated 1%)
adding: console-timestamp.log.gz (deflated 2%)
adding: _sys-info.log.gz (stored 0%)
% Total % Received % Xferd Average Speed Time Time Time Current
Dload Upload Total Spent Left Speed
0 0 0 0 0 0 0 0 --:--:-- --:--:-- --:--:-- 0100 42462 0 0 100 42462 0 119k --:--:-- --:--:-- --:--:-- 120k
<https://jenkins.onap.org/job/sdc-amsterdam-csit-sanity-testng/ws/>
+ set +x
Build logs: <a href="https://logs.onap.org/production/vex-yul-ecomp-jenkins-1/sdc-amsterdam-csit-sanity-testng/18">https://logs.onap.org/production/vex-yul-ecomp-jenkins-1/sdc-amsterdam-csit-sanity-testng/18</a>
[sdc-amsterdam-csit-sanity-testng] $ /bin/bash /tmp/jenkins7781558278921907172.sh
[description-setter] Description set: Build logs: <a href="https://logs.onap.org/production/vex-yul-ecomp-jenkins-1/sdc-amsterdam-csit-sanity-testng/18">https://logs.onap.org/production/vex-yul-ecomp-jenkins-1/sdc-amsterdam-csit-sanity-testng/18</a>
TestNG Reports Processing: START
Looking for TestNG results report in workspace using pattern: archives/testng-results.xml
Did not find any matching files.
Recording test results
ERROR: Step ‘Publish JUnit test result report’ failed: No test report files were found. Configuration error?


[sdc] sdc-amsterdam-csit-sanity-testng - Build # 17 - Failure!

Jenkins <donotreply@...>
 

sdc-amsterdam-csit-sanity-testng - Build # 17 - Failure:

Please refer to the logs server URL for console logs when possible
and use the Jenkins Build URL as a last resort.

Console Logs URL:
https://logs.onap.org/production/vex-yul-ecomp-jenkins-1/sdc-amsterdam-csit-sanity-testng/17

Jenkins Build URL:
https://jenkins.onap.org/job/sdc-amsterdam-csit-sanity-testng/17/


Build failed in Jenkins: sdc-amsterdam-csit-sanity-testng #17

Jenkins <donotreply@...>
 

See <https://jenkins.onap.org/job/sdc-amsterdam-csit-sanity-testng/17/display/redirect?page=changes>

Changes:

[gary.i.wu] Update lab environment configuration

------------------------------------------
[...truncated 91.46 KB...]
+ SUITES=<https://jenkins.onap.org/job/sdc-amsterdam-csit-sanity-testng/ws/test/csit/tests/sdc/sanity>
+ echo ROBOT_VARIABLES=-v BE_IP:172.17.0.4
ROBOT_VARIABLES=-v BE_IP:172.17.0.4
+ echo 'Starting Robot test suites <https://jenkins.onap.org/job/sdc-amsterdam-csit-sanity-testng/ws/test/csit/tests/sdc/sanity> ...'
Starting Robot test suites <https://jenkins.onap.org/job/sdc-amsterdam-csit-sanity-testng/ws/test/csit/tests/sdc/sanity> ...
+ set +e
+ pybot -N plans/sdc/sanity -v WORKSPACE:/tmp -v BE_IP:172.17.0.4 <https://jenkins.onap.org/job/sdc-amsterdam-csit-sanity-testng/ws/test/csit/tests/sdc/sanity>
==============================================================================
plans/sdc/sanity :: Sdc - HealthCheck
==============================================================================
plans/sdc/sanity.Test1
==============================================================================
Get Requests health check ok | FAIL |
500 != 200
------------------------------------------------------------------------------
plans/sdc/sanity.Test1 | FAIL |
1 critical test, 0 passed, 1 failed
1 test total, 0 passed, 1 failed
==============================================================================
plans/sdc/sanity :: Sdc - HealthCheck | FAIL |
1 critical test, 0 passed, 1 failed
1 test total, 0 passed, 1 failed
==============================================================================
Output: /tmp/tmp.V2toVRjYXK-robot-workdir/output.xml
Log: /tmp/tmp.V2toVRjYXK-robot-workdir/log.html
Report: /tmp/tmp.V2toVRjYXK-robot-workdir/report.html
+ RESULT=1
+ set -e
+ echo 'RESULT: ' 1
RESULT: 1
+ rsync -av /tmp/tmp.V2toVRjYXK-robot-workdir/ <https://jenkins.onap.org/job/sdc-amsterdam-csit-sanity-testng/ws/archives>
sending incremental file list
./
log.html
output.xml
report.html
testplan.txt

sent 422,932 bytes received 95 bytes 846,054.00 bytes/sec
total size is 422,506 speedup is 1.00
+ docker ps --format '{{.Image}}'
+ docker_stats
+ tee <https://jenkins.onap.org/job/sdc-amsterdam-csit-sanity-testng/ws/archives/_sysinfo-2-after-robot.txt>
+ echo '> top -bn1 | head -3'
+ top -bn1
+ head -3
top -bn1 | head -3
top - 15:51:11 up 21 min, 0 users, load average: 3.03, 2.16, 1.57
Tasks: 205 total, 1 running, 204 sleeping, 0 stopped, 0 zombie
%Cpu(s): 9.0 us, 2.2 sy, 0.1 ni, 81.5 id, 3.3 wa, 0.0 hi, 0.1 si, 3.9 st
+ echo
+ echo '> free -h'
+ free -h

free -h
total used free shared buff/cache available
Mem: 7.8G 6.3G 906M 8.9M 641M 1.1G
Swap: 0B 0B 0B
+ echo
+ echo '> docker ps'
+ docker ps

docker ps
CONTAINER ID IMAGE COMMAND CREATED STATUS PORTS NAMES
46c2446ebbe0 nexus3.onap.org:10001/openecomp/sdc-frontend:1.1.1-STAGING-latest "/root/startup.sh" 3 minutes ago Up 3 minutes 0.0.0.0:8181->8181/tcp, 8080/tcp, 0.0.0.0:9443->9443/tcp sdc-FE
5811404d8a02 nexus3.onap.org:10001/openecomp/sdc-backend:1.1.1-STAGING-latest "/root/startup.sh" 11 minutes ago Up 11 minutes 0.0.0.0:8080->8080/tcp, 0.0.0.0:8443->8443/tcp sdc-BE
f94bb8b62ed7 nexus3.onap.org:10001/openecomp/sdc-cassandra:1.1.1-STAGING-latest "/root/startup.sh" 17 minutes ago Up 17 minutes 7000-7001/tcp, 0.0.0.0:9042->9042/tcp, 7199/tcp, 0.0.0.0:9160->9160/tcp sdc-cs
34ed6f463508 nexus3.onap.org:10001/openecomp/sdc-elasticsearch:1.1.1-STAGING-latest "/root/startup.sh" 18 minutes ago Up 18 minutes 0.0.0.0:9200->9200/tcp, 0.0.0.0:9300->9300/tcp sdc-es
+ echo

+ echo '> docker stats --no-stream'
docker stats --no-stream
+ docker stats --no-stream
CONTAINER CPU % MEM USAGE / LIMIT MEM % NET I/O BLOCK I/O PIDS
46c2446ebbe0 0.15% 861.7 MiB / 2 GiB 42.08% 111 kB / 72.17 kB 7.52 MB / 315.4 kB 50
5811404d8a02 9.24% 2.27 GiB / 4 GiB 56.75% 69.31 MB / 26.12 MB 36.66 MB / 4.325 MB 129
f94bb8b62ed7 1.58% 2.251 GiB / 7.796 GiB 28.88% 25.24 MB / 69.05 MB 1.118 MB / 305.7 MB 114
34ed6f463508 0.45% 507.6 MiB / 1 GiB 49.57% 388.6 kB / 251.9 kB 4.481 MB / 3.391 MB 102
+ echo

+ cd <https://jenkins.onap.org/job/sdc-amsterdam-csit-sanity-testng/ws/test/csit/plans/sdc/sanity>
+ TEARDOWN=<https://jenkins.onap.org/job/sdc-amsterdam-csit-sanity-testng/ws/test/csit/plans/sdc/sanity/teardown.sh>
+ '[' -f <https://jenkins.onap.org/job/sdc-amsterdam-csit-sanity-testng/ws/test/csit/plans/sdc/sanity/teardown.sh> ']'
+ echo 'Running teardown script <https://jenkins.onap.org/job/sdc-amsterdam-csit-sanity-testng/ws/test/csit/plans/sdc/sanity/teardown.sh'>
Running teardown script <https://jenkins.onap.org/job/sdc-amsterdam-csit-sanity-testng/ws/test/csit/plans/sdc/sanity/teardown.sh>
+ source <https://jenkins.onap.org/job/sdc-amsterdam-csit-sanity-testng/ws/test/csit/plans/sdc/sanity/teardown.sh>
++ source <https://jenkins.onap.org/job/sdc-amsterdam-csit-sanity-testng/ws/test/csit/scripts/sdc/kill_containers_and_remove_dataFolders.sh>
+++ echo 'This is <https://jenkins.onap.org/job/sdc-amsterdam-csit-sanity-testng/ws/test/csit/scripts/sdc/kill_and_remove_dataFolder.sh'>
This is <https://jenkins.onap.org/job/sdc-amsterdam-csit-sanity-testng/ws/test/csit/scripts/sdc/kill_and_remove_dataFolder.sh>
++++ docker ps -a -q --filter=name=sdc
+++ docker stop ee84be03cb7f 46c2446ebbe0 5811404d8a02 f94bb8b62ed7 34ed6f463508
ee84be03cb7f
46c2446ebbe0
5811404d8a02
f94bb8b62ed7
34ed6f463508
++++ docker ps -a -q --filter=name=sdc
+++ docker rm ee84be03cb7f 46c2446ebbe0 5811404d8a02 f94bb8b62ed7 34ed6f463508
ee84be03cb7f
46c2446ebbe0
5811404d8a02
f94bb8b62ed7
34ed6f463508
+ exit 1
Build step 'Execute shell' marked build as failure
$ ssh-agent -k
unset SSH_AUTH_SOCK;
unset SSH_AGENT_PID;
echo Agent pid 2316 killed;
[ssh-agent] Stopped.
Robot results publisher started...
-Parsing output xml:
Done!
-Copying log files to build dir:
Done!
-Assigning results to build:
Done!
-Checking thresholds:
Done!
Done publishing Robot results.
[PostBuildScript] - Execution post build scripts.
[sdc-amsterdam-csit-sanity-testng] $ /bin/bash /tmp/jenkins5495277980302556158.sh
---> sysstat.sh
grep: /etc/default/sysstat: No such file or directory
provisioning config files...
copy managed file [jenkins-log-archives-settings] to file:<https://jenkins.onap.org/job/sdc-amsterdam-csit-sanity-testng/ws/@tmp/config4745637061584062023tmp>
[EnvInject] - Injecting environment variables from a build step.
[EnvInject] - Injecting as environment variables the properties content
SERVER_ID=logs

[EnvInject] - Variables injected successfully.
[sdc-amsterdam-csit-sanity-testng] $ /bin/bash /tmp/jenkins6666936320580486475.sh
---> create-netrc.sh
[sdc-amsterdam-csit-sanity-testng] $ /bin/bash /tmp/jenkins3562678834051127206.sh
---> lftools-install.sh
lftools, version 0.11.1
---> logs-deploy.sh
+ ARCHIVE_ARTIFACTS=' **/target/surefire-reports/*-output.txt'
+ LOGS_SERVER=https://logs.onap.org
+ '[' https://logs.onap.org == None ']'
+ NEXUS_URL=https://nexus.onap.org
+ NEXUS_PATH=production/vex-yul-ecomp-jenkins-1/sdc-amsterdam-csit-sanity-testng/17
+ BUILD_URL=https://jenkins.onap.org/job/sdc-amsterdam-csit-sanity-testng/17/
+ lftools deploy archives -p ' **/target/surefire-reports/*-output.txt' https://nexus.onap.org production/vex-yul-ecomp-jenkins-1/sdc-amsterdam-csit-sanity-testng/17 <https://jenkins.onap.org/job/sdc-amsterdam-csit-sanity-testng/ws/>
Deploying archives...
/tmp/tmp.UXj3e92iIc <https://jenkins.onap.org/job/sdc-amsterdam-csit-sanity-testng/ws/>
<https://jenkins.onap.org/job/sdc-amsterdam-csit-sanity-testng/ws/> /tmp/tmp.UXj3e92iIc <https://jenkins.onap.org/job/sdc-amsterdam-csit-sanity-testng/ws/>
/tmp/tmp.UXj3e92iIc <https://jenkins.onap.org/job/sdc-amsterdam-csit-sanity-testng/ws/>
292K <https://jenkins.onap.org/job/sdc-amsterdam-csit-sanity-testng/ws/archives.zip>
Pushing archives.log.gz
% Total % Received % Xferd Average Speed Time Time Time Current
Dload Upload Total Spent Left Speed
0 0 0 0 0 0 0 0 --:--:-- --:--:-- --:--:-- 0 0 0 0 0 0 0 0 0 --:--:-- --:--:-- --:--:-- 0100 33 0 0 100 33 0 60 --:--:-- --:--:-- --:--:-- 60
Pushing archives.zip
% Total % Received % Xferd Average Speed Time Time Time Current
Dload Upload Total Spent Left Speed
0 0 0 0 0 0 0 0 --:--:-- --:--:-- --:--:-- 0100 288k 0 0 100 288k 0 618k --:--:-- --:--:-- --:--:-- 619k
<https://jenkins.onap.org/job/sdc-amsterdam-csit-sanity-testng/ws/>
+ lftools deploy logs https://nexus.onap.org production/vex-yul-ecomp-jenkins-1/sdc-amsterdam-csit-sanity-testng/17 https://jenkins.onap.org/job/sdc-amsterdam-csit-sanity-testng/17/
Deploying logs...
/tmp/tmp.MnI8cY8BGr <https://jenkins.onap.org/job/sdc-amsterdam-csit-sanity-testng/ws/>
build-url: https://jenkins.onap.org/job/sdc-amsterdam-csit-sanity-testng/17/
---> uname -a:
Linux ubuntu1604-docker-8c-8g-2221 4.4.0-59-generic #80-Ubuntu SMP Fri Jan 6 17:47:47 UTC 2017 x86_64 x86_64 x86_64 GNU/Linux

---> lscpu:
Architecture: x86_64
CPU op-mode(s): 32-bit, 64-bit
Byte Order: Little Endian
CPU(s): 8
On-line CPU(s) list: 0-7
Thread(s) per core: 1
Core(s) per socket: 1
Socket(s): 8
NUMA node(s): 1
Vendor ID: GenuineIntel
CPU family: 6
Model: 42
Model name: Intel Xeon E312xx (Sandy Bridge)
Stepping: 1
CPU MHz: 2899.996
BogoMIPS: 5799.99
Hypervisor vendor: KVM
Virtualization type: full
L1d cache: 32K
L1i cache: 32K
L2 cache: 4096K
NUMA node0 CPU(s): 0-7
Flags: fpu vme de pse tsc msr pae mce cx8 apic sep mtrr pge mca cmov pat pse36 clflush mmx fxsr sse sse2 ss syscall nx pdpe1gb rdtscp lm constant_tsc rep_good nopl eagerfpu pni pclmulqdq ssse3 cx16 pcid sse4_1 sse4_2 x2apic popcnt tsc_deadline_timer aes xsave avx hypervisor lahf_lm xsaveopt arat

---> nproc:
8

---> df -h:
Filesystem Size Used Avail Use% Mounted on
udev 3.9G 0 3.9G 0% /dev
tmpfs 799M 8.7M 790M 2% /run
/dev/vda1 194G 7.8G 187G 5% /
tmpfs 3.9G 0 3.9G 0% /dev/shm
tmpfs 5.0M 0 5.0M 0% /run/lock
tmpfs 3.9G 0 3.9G 0% /sys/fs/cgroup
tmpfs 799M 0 799M 0% /run/user/1001

---> free -m:
total used free shared buff/cache available
Mem: 7982 512 6746 8 724 7130
Swap: 0 0 0

---> ip addr:
1: lo: <LOOPBACK,UP,LOWER_UP> mtu 65536 qdisc noqueue state UNKNOWN group default qlen 1
link/loopback 00:00:00:00:00:00 brd 00:00:00:00:00:00
inet 127.0.0.1/8 scope host lo
valid_lft forever preferred_lft forever
inet6 ::1/128 scope host
valid_lft forever preferred_lft forever
2: ens3: <BROADCAST,MULTICAST,UP,LOWER_UP> mtu 1458 qdisc pfifo_fast state UP group default qlen 1000
link/ether fa:16:3e:68:e3:75 brd ff:ff:ff:ff:ff:ff
inet 10.30.106.13/23 brd 10.30.107.255 scope global ens3
valid_lft forever preferred_lft forever
inet6 fe80::f816:3eff:fe68:e375/64 scope link
valid_lft forever preferred_lft forever
3: docker0: <NO-CARRIER,BROADCAST,MULTICAST,UP> mtu 1500 qdisc noqueue state DOWN group default
link/ether 02:42:d0:32:c3:61 brd ff:ff:ff:ff:ff:ff
inet 172.17.0.1/16 scope global docker0
valid_lft forever preferred_lft forever
inet6 fe80::42:d0ff:fe32:c361/64 scope link
valid_lft forever preferred_lft forever

-----END_OF_BUILD-----
2018-01-13 15:52:25 URL:https://jenkins.onap.org/job/sdc-amsterdam-csit-sanity-testng/17/consoleText [105395] -> "console.log" [1]
2018-01-13 15:52:25 URL:https://jenkins.onap.org/job/sdc-amsterdam-csit-sanity-testng/17/timestamps/?time=HH:mm:ss&appendLog [128945] -> "console-timestamp.log" [1]
adding: _build-details.log.gz (stored 0%)
adding: _build-enviroment-variables.log.gz (stored 0%)
adding: console.log.gz (deflated 1%)
adding: console-timestamp.log.gz (deflated 2%)
adding: _sys-info.log.gz (stored 0%)
% Total % Received % Xferd Average Speed Time Time Time Current
Dload Upload Total Spent Left Speed
0 0 0 0 0 0 0 0 --:--:-- --:--:-- --:--:-- 0100 43058 0 0 100 43058 0 303k --:--:-- --:--:-- --:--:-- 304k
<https://jenkins.onap.org/job/sdc-amsterdam-csit-sanity-testng/ws/>
+ set +x
Build logs: <a href="https://logs.onap.org/production/vex-yul-ecomp-jenkins-1/sdc-amsterdam-csit-sanity-testng/17">https://logs.onap.org/production/vex-yul-ecomp-jenkins-1/sdc-amsterdam-csit-sanity-testng/17</a>
[sdc-amsterdam-csit-sanity-testng] $ /bin/bash /tmp/jenkins1614743378631865988.sh
[description-setter] Description set: Build logs: <a href="https://logs.onap.org/production/vex-yul-ecomp-jenkins-1/sdc-amsterdam-csit-sanity-testng/17">https://logs.onap.org/production/vex-yul-ecomp-jenkins-1/sdc-amsterdam-csit-sanity-testng/17</a>
TestNG Reports Processing: START
Looking for TestNG results report in workspace using pattern: archives/testng-results.xml
Did not find any matching files.
Recording test results
ERROR: Step ‘Publish JUnit test result report’ failed: No test report files were found. Configuration error?


[sdc] sdc-amsterdam-csit-sanity-testng - Build # 16 - Aborted!

Jenkins <donotreply@...>
 

sdc-amsterdam-csit-sanity-testng - Build # 16 - Aborted:

Please refer to the logs server URL for console logs when possible
and use the Jenkins Build URL as a last resort.

Console Logs URL:
https://logs.onap.org/production/vex-yul-ecomp-jenkins-1/sdc-amsterdam-csit-sanity-testng/16

Jenkins Build URL:
https://jenkins.onap.org/job/sdc-amsterdam-csit-sanity-testng/16/


[sdc] sdc-amsterdam-csit-sanity-testng - Build # 15 - Aborted!

donotreply@...
 

sdc-amsterdam-csit-sanity-testng - Build # 15 - Aborted:

Please refer to the logs server URL for console logs when possible
and use the Jenkins Build URL as a last resort.

Console Logs URL:
https://logs.onap.org/production/vex-yul-ecomp-jenkins-1/sdc-amsterdam-csit-sanity-testng/15

Jenkins Build URL:
https://jenkins.onap.org/job/sdc-amsterdam-csit-sanity-testng/15/


[sdc] sdc-amsterdam-csit-sanity-testng - Build # 14 - Aborted!

donotreply@...
 

sdc-amsterdam-csit-sanity-testng - Build # 14 - Aborted:

Please refer to the logs server URL for console logs when possible
and use the Jenkins Build URL as a last resort.

Console Logs URL:
https://logs.onap.org/production/vex-yul-ecomp-jenkins-1/sdc-amsterdam-csit-sanity-testng/14

Jenkins Build URL:
https://jenkins.onap.org/job/sdc-amsterdam-csit-sanity-testng/14/

1 - 12 of 12